Reaction Details
TargetXanthine dehydrogenase/oxidase
LigandBDBM35440
Substrate/Competitorn/a
Meas. Tech.ChEMBL_1285789 (CHEMBL3108061)
IC50 11100±n/a nM
Citation Sharma, SSharma, KOjha, RKumar, DSingh, GNepali, KBedi, PM Microwave assisted synthesis of naphthopyrans catalysed by silica supported fluoroboric acid as a new class of non purine xanthine oxidase inhibitors. Bioorg Med Chem Lett24:495-500 (2014) 
 
Xanthine dehydrogenase/oxidase
Name:Xanthine dehydrogenase/oxidase
Type:Protein
Mol. Mass.:146809.00
Organism:Bos taurus (Bovine)
Description:P80457
Residue:1332
BDBM35440
NameBDBM35440
Synonyms:ALLOPURINOL SMR000059083 | cid_2094
TypeSmall organic molecule
Emp. Form.C5H4N4O
Mol. Mass.136.1115
SMILESO=c1[nH]cnc2n[nH]cc12