Reaction Details
TargetPoly [ADP-ribose] polymerase 1
LigandBDBM50445968
Substrate/Competitorn/a
Meas. Tech.ChEMBL_1283536 (CHEMBL3107467)
IC50 270±n/a nM
Citation Cincinelli, RMusso, LMerlini, LGiannini, GVesci, LMilazzo, FMCarenini, NPerego, PPenco, SArtali, RZunino, FPisano, CDallavalle, S 7-Azaindole-1-carboxamides as a new class of PARP-1 inhibitors. Bioorg Med Chem22:1089-103 (2014) 
 
Poly [ADP-ribose] polymerase 1
Name:Poly [ADP-ribose] polymerase 1
Type:n/a
Mol. Mass.:113114.22
Organism:Homo sapiens (Human)
Description:P09874
Residue:1014
BDBM50445968
NameBDBM50445968
Synonyms:CHEMBL3105879
TypeSmall organic molecule
Emp. Form.C14H10FN3O
Mol. Mass.255.2471
SMILESNC(=O)n1ccc2ccc(nc12)-c1ccc(F)cc1