Reaction Details
TargetAldo-keto reductase family 1 member C3
LigandBDBM50446017
Substrate/Competitorn/a
Meas. Tech.ChEMBL_1283742 (CHEMBL3108467)
IC50 10.0±n/a nM
Citation Flanagan, JUAtwell, GJHeinrich, DMBrooke, DGSilva, SRigoreau, LJTrivier, ETurnbull, APRaynham, TJamieson, SMDenny, WA Morpholylureas are a new class of potent and selective inhibitors of the type 5 17-ß-hydroxysteroid dehydrogenase (AKR1C3). Bioorg Med Chem22:967-77 (2014) 
 
Aldo-keto reductase family 1 member C3
Name:Aldo-keto reductase family 1 member C3
Type:Enzyme
Mol. Mass.:36859.86
Organism:Homo sapiens (Human)
Description:P42330
Residue:323
BDBM50446017
NameBDBM50446017
Synonyms:CHEMBL3103349
TypeSmall organic molecule
Emp. Form.C15H20IN3O2
Mol. Mass.401.2427
SMILESIc1ccc(cc1)N1CCN(CC1)C(=O)N1CCOCC1