Reaction Details
TargetP2X purinoceptor 4
LigandBDBM50446073
Substrate/Competitorn/a
Meas. Tech.ChEMBL_1283892 (CHEMBL3106505)
IC50 27400±n/a nM
Citation Tian, MAbdelrahman, AWeinhausen, SHinz, SWeyer, SDosa, SEl-Tayeb, AMüller, CE Carbamazepine derivatives with P2X4 receptor-blocking activity. Bioorg Med Chem22:1077-88 (2014) 
 
P2X purinoceptor 4
Name:P2X purinoceptor 4
Type:Enzyme Catalytic Domain
Mol. Mass.:43374.70
Organism:Homo sapiens (Human)
Description:Purinergic, P2X4 0 HUMAN::Q99571
Residue:388
BDBM50446073
NameBDBM50446073
Synonyms:CHEMBL3103405
TypeSmall organic molecule
Emp. Form.C24H22N2O2
Mol. Mass.370.4437
SMILESCOc1ccc(CCNC(=O)N2c3ccccc3C=Cc3ccccc23)cc1