Reaction Details
TargetP2X purinoceptor 4
LigandBDBM50446083
Substrate/Competitorn/a
Meas. Tech.ChEMBL_1283892 (CHEMBL3106505)
IC50 78900±n/a nM
Citation Tian, MAbdelrahman, AWeinhausen, SHinz, SWeyer, SDosa, SEl-Tayeb, AMüller, CE Carbamazepine derivatives with P2X4 receptor-blocking activity. Bioorg Med Chem22:1077-88 (2014) 
 
P2X purinoceptor 4
Name:P2X purinoceptor 4
Type:Enzyme Catalytic Domain
Mol. Mass.:43374.70
Organism:Homo sapiens (Human)
Description:Purinergic, P2X4 0 HUMAN::Q99571
Residue:388
BDBM50446083
NameBDBM50446083
Synonyms:CHEMBL3103402
TypeSmall organic molecule
Emp. Form.C22H18N2O
Mol. Mass.326.3911
SMILESO=C(NCc1ccccc1)N1c2ccccc2C=Cc2ccccc12