Reaction Details
TargetP2X purinoceptor 3
LigandBDBM50446060
Substrate/Competitorn/a
Meas. Tech.ChEMBL_1283752 (CHEMBL3108477)
IC50 7180±n/a nM
Citation Tian, MAbdelrahman, AWeinhausen, SHinz, SWeyer, SDosa, SEl-Tayeb, AMüller, CE Carbamazepine derivatives with P2X4 receptor-blocking activity. Bioorg Med Chem22:1077-88 (2014) 
 
P2X purinoceptor 3
Name:P2X purinoceptor 3
Type:Protein
Mol. Mass.:44292.02
Organism:Homo sapiens (Human)
Description:P56373
Residue:397
BDBM50446060
NameBDBM50446060
Synonyms:CHEMBL3103385
TypeSmall organic molecule
Emp. Form.C21H24N2O
Mol. Mass.320.4281
SMILESCC(C)N(C(C)C)C(=O)N1c2ccccc2C=Cc2ccccc12