Reaction Details
TargetP2X purinoceptor 3
LigandBDBM50446069
Substrate/Competitorn/a
Meas. Tech.ChEMBL_1283752 (CHEMBL3108477)
IC50 29800±n/a nM
Citation Tian, MAbdelrahman, AWeinhausen, SHinz, SWeyer, SDosa, SEl-Tayeb, AMüller, CE Carbamazepine derivatives with P2X4 receptor-blocking activity. Bioorg Med Chem22:1077-88 (2014) 
 
P2X purinoceptor 3
Name:P2X purinoceptor 3
Type:Protein
Mol. Mass.:44292.02
Organism:Homo sapiens (Human)
Description:P56373
Residue:397
BDBM50446069
NameBDBM50446069
Synonyms:CHEMBL3103372
TypeSmall organic molecule
Emp. Form.C19H18N2O
Mol. Mass.290.359
SMILESO=C(N1CCCC1)N1c2ccccc2C=Cc2ccccc12