Reaction Details
TargetP2X purinoceptor 2
LigandBDBM50446070
Substrate/Competitorn/a
Meas. Tech.ChEMBL_1283754 (CHEMBL3108479)
IC50>100000±n/a nM
Citation Tian, MAbdelrahman, AWeinhausen, SHinz, SWeyer, SDosa, SEl-Tayeb, AMüller, CE Carbamazepine derivatives with P2X4 receptor-blocking activity. Bioorg Med Chem22:1077-88 (2014) 
 
P2X purinoceptor 2
Name:P2X purinoceptor 2
Type:Enzyme Catalytic Domain
Mol. Mass.:51765.18
Organism:Homo sapiens (Human)
Description:PurinergicP2X2/3 0 HUMAN::Q9UBL9
Residue:471
BDBM50446070
NameBDBM50446070
Synonyms:CHEMBL3103371
TypeSmall organic molecule
Emp. Form.C20H20N2O
Mol. Mass.304.3856
SMILESO=C(N1CCCCC1)N1c2ccccc2C=Cc2ccccc12