Reaction Details
TargetP2X purinoceptor 1
LigandBDBM50446068
Substrate/Competitorn/a
Meas. Tech.ChEMBL_1283755 (CHEMBL3108480)
IC50 4550±n/a nM
Citation Tian, MAbdelrahman, AWeinhausen, SHinz, SWeyer, SDosa, SEl-Tayeb, AMüller, CE Carbamazepine derivatives with P2X4 receptor-blocking activity. Bioorg Med Chem22:1077-88 (2014) 
 
P2X purinoceptor 1
Name:P2X purinoceptor 1
Type:Enzyme Catalytic Domain
Mol. Mass.:44992.65
Organism:Homo sapiens (Human)
Description:Purinergic, P2X 0 HUMAN::P51575
Residue:399
BDBM50446068
NameBDBM50446068
Synonyms:CHEMBL3103375
TypeSmall organic molecule
Emp. Form.C21H24N2O
Mol. Mass.320.4281
SMILESCCCN(CCC)C(=O)N1c2ccccc2C=Cc2ccccc12