Reaction Details
TargetP2X purinoceptor 1
LigandBDBM50446076
Substrate/Competitorn/a
Meas. Tech.ChEMBL_1283755 (CHEMBL3108480)
IC50 25200±n/a nM
Citation Tian, MAbdelrahman, AWeinhausen, SHinz, SWeyer, SDosa, SEl-Tayeb, AMüller, CE Carbamazepine derivatives with P2X4 receptor-blocking activity. Bioorg Med Chem22:1077-88 (2014) 
 
P2X purinoceptor 1
Name:P2X purinoceptor 1
Type:Enzyme Catalytic Domain
Mol. Mass.:44992.65
Organism:Homo sapiens (Human)
Description:Purinergic, P2X 0 HUMAN::P51575
Residue:399
BDBM50446076
NameBDBM50446076
Synonyms:CHEMBL1483754
TypeSmall organic molecule
Emp. Form.C19H20N2O
Mol. Mass.292.3749
SMILESCCN(CC)C(=O)N1c2ccccc2C=Cc2ccccc12