Reaction Details
TargetP2X purinoceptor 4
LigandBDBM50446076
Substrate/Competitorn/a
Meas. Tech.ChEMBL_1283887 (CHEMBL3106338)
IC50>100000±n/a nM
Citation Tian, MAbdelrahman, AWeinhausen, SHinz, SWeyer, SDosa, SEl-Tayeb, AMüller, CE Carbamazepine derivatives with P2X4 receptor-blocking activity. Bioorg Med Chem22:1077-88 (2014) 
 
P2X purinoceptor 4
Name:P2X purinoceptor 4
Type:PROTEIN
Mol. Mass.:43443.55
Organism:Mus musculus
Description:ChEMBL_1283887
Residue:388
BDBM50446076
NameBDBM50446076
Synonyms:CHEMBL1483754
TypeSmall organic molecule
Emp. Form.C19H20N2O
Mol. Mass.292.3749
SMILESCCN(CC)C(=O)N1c2ccccc2C=Cc2ccccc12