Reaction Details
TargetP2X purinoceptor 4
LigandBDBM50446085
Substrate/Competitorn/a
Meas. Tech.ChEMBL_1283892 (CHEMBL3106505)
IC50>10000±n/a nM
Citation Tian, MAbdelrahman, AWeinhausen, SHinz, SWeyer, SDosa, SEl-Tayeb, AMüller, CE Carbamazepine derivatives with P2X4 receptor-blocking activity. Bioorg Med Chem22:1077-88 (2014) 
 
P2X purinoceptor 4
Name:P2X purinoceptor 4
Type:Enzyme Catalytic Domain
Mol. Mass.:43374.70
Organism:Homo sapiens (Human)
Description:Purinergic, P2X4 0 HUMAN::Q99571
Residue:388
BDBM50446085
NameBDBM50446085
Synonyms:CHEMBL3103367
TypeSmall organic molecule
Emp. Form.C15H13N3O
Mol. Mass.251.2832
SMILESNC(=O)N1c2ccccc2CC(=N)c2ccccc12