Reaction Details
TargetPoly [ADP-ribose] polymerase 1
LigandBDBM27500
Substrate/Competitorn/a
Meas. Tech.ChEMBL_1288125 (CHEMBL3110585)
IC50 300±n/a nM
Citation Haikarainen, TNarwal, MJoensuu, PLehtiö, L Evaluation and Structural Basis for the Inhibition of Tankyrases by PARP Inhibitors. ACS Med Chem Lett5:18-22 (2014) 
 
Poly [ADP-ribose] polymerase 1
Name:Poly [ADP-ribose] polymerase 1
Type:PROTEIN
Mol. Mass.:113518.81
Organism:Bos taurus
Description:ChEMBL_1288125
Residue:1016
BDBM27500
NameBDBM27500
Synonyms:5,6-dihydrophenanthridin-6-one 5H-Phenanthridin-6-one (PTD) CHEMBL45245 Phenanthridone | phenanthridin-6(5H)-one
TypeSmall organic molecule
Emp. Form.C13H9NO
Mol. Mass.195.2167
SMILESO=c1[nH]c2ccccc2c2ccccc12