Reaction Details
TargetKallikrein-5 [D153N]
LigandBDBM50446219
Substrate/Competitorn/a
Meas. Tech.ChEMBL_1288000 (CHEMBL3110699)
IC50 9000±n/a nM
Citation Oliveira, JPFreitas, RFMelo, LSBarros, TGSantos, JAJuliano, MAPinheiro, SBlaber, MJuliano, LMuri, EMPuzer, L Isomannide-based peptidomimetics as inhibitors for human tissue kallikreins 5 and 7. ACS Med Chem Lett5:128-32 (2014) 
 
Kallikrein-5 [D153N]
Name:Kallikrein-5 [D153N]
Type:PROTEIN
Mol. Mass.:32031.75
Organism:Homo sapiens (Human)
Description:ChEMBL_1282456
Residue:293
BDBM50446219
NameBDBM50446219
Synonyms:CHEMBL3109165
TypeSmall organic molecule
Emp. Form.C32H42N2O9
Mol. Mass.598.6839
SMILESCC(C)(C)OC(=O)N[C@@H](CCCCNC(=O)OCc1ccccc1)C(=O)O[C@@H]1CO[C@@H]2[C@@H](CO[C@H]12)OCc1ccccc1