Reaction Details
TargetKallikrein-7
LigandBDBM50446212
Substrate/Competitorn/a
Meas. Tech.ChEMBL_1287998 (CHEMBL3110697)
Ki 15100±n/a nM
Citation Oliveira, JPFreitas, RFMelo, LSBarros, TGSantos, JAJuliano, MAPinheiro, SBlaber, MJuliano, LMuri, EMPuzer, L Isomannide-based peptidomimetics as inhibitors for human tissue kallikreins 5 and 7. ACS Med Chem Lett5:128-32 (2014) 
 
Kallikrein-7
Name:Kallikrein-7
Type:PROTEIN
Mol. Mass.:27535.05
Organism:Homo sapiens (Human)
Description:ChEMBL_1469257
Residue:253
BDBM50446212
NameBDBM50446212
Synonyms:CHEMBL3109057
TypeSmall organic molecule
Emp. Form.C26H30N2O6
Mol. Mass.466.5262
SMILESO=C(N[C@H]1CO[C@@H]2[C@@H](CO[C@H]12)OCc1ccccc1)[C@H]1CCCN1C(=O)OCc1ccccc1