Reaction Details
TargetKallikrein-5 [D153N]
LigandBDBM50446221
Substrate/Competitorn/a
Meas. Tech.ChEMBL_1287999 (CHEMBL3110698)
Ki 400±n/a nM
Citation Oliveira, JPFreitas, RFMelo, LSBarros, TGSantos, JAJuliano, MAPinheiro, SBlaber, MJuliano, LMuri, EMPuzer, L Isomannide-based peptidomimetics as inhibitors for human tissue kallikreins 5 and 7. ACS Med Chem Lett5:128-32 (2014) 
 
Kallikrein-5 [D153N]
Name:Kallikrein-5 [D153N]
Type:PROTEIN
Mol. Mass.:32031.75
Organism:Homo sapiens (Human)
Description:ChEMBL_1282456
Residue:293
BDBM50446221
NameBDBM50446221
Synonyms:CHEMBL3109163
TypeSmall organic molecule
Emp. Form.C35H38N2O8
Mol. Mass.614.6848
SMILESO=C(O[C@@H]1CO[C@@H]2[C@@H](CO[C@H]12)OCc1ccccc1)[C@H](Cc1ccccc1)NC(=O)[C@@H]1CCCN1C(=O)OCc1ccccc1