Reaction Details
TargetKallikrein-7
LigandBDBM50446226
Substrate/Competitorn/a
Meas. Tech.ChEMBL_1287998 (CHEMBL3110697)
Ki 15600±n/a nM
Citation Oliveira, JPFreitas, RFMelo, LSBarros, TGSantos, JAJuliano, MAPinheiro, SBlaber, MJuliano, LMuri, EMPuzer, L Isomannide-based peptidomimetics as inhibitors for human tissue kallikreins 5 and 7. ACS Med Chem Lett5:128-32 (2014) 
 
Kallikrein-7
Name:Kallikrein-7
Type:PROTEIN
Mol. Mass.:27535.05
Organism:Homo sapiens (Human)
Description:ChEMBL_1469257
Residue:253
BDBM50446226
NameBDBM50446226
Synonyms:CHEMBL3109158
TypeSmall organic molecule
Emp. Form.C23H31NO7
Mol. Mass.433.4947
SMILESCC(C)(C)OC(=O)N1CCC[C@H]1C(=O)O[C@@H]1CO[C@@H]2[C@@H](CO[C@H]12)OCc1ccccc1