Reaction Details
TargetProteinase-activated receptor 1
LigandBDBM50446326
Substrate/Competitorn/a
Meas. Tech.ChEMBL_1286966 (CHEMBL3111131)
Ki 239±n/a nM
Citation Chelliah, MVChackalamannil, SXia, YGreenlee, WJAhn, HSKurowski, SBoykow, GHsieh, YChintala, M Himbacine-derived thrombin receptor antagonists: c7-aminomethyl and c9a-hydroxy analogues of vorapaxar. ACS Med Chem Lett5:183-7 (2014) 
 
Proteinase-activated receptor 1
Name:Proteinase-activated receptor 1
Type:Protein
Mol. Mass.:47450.07
Organism:Homo sapiens (Human)
Description:P25116
Residue:425
BDBM50446326
NameBDBM50446326
Synonyms:CHEMBL3109575
TypeSmall organic molecule
Emp. Form.C33H32F3N3O3
Mol. Mass.575.6207
SMILESC[C@H]1OC(=O)[C@@H]2C[C@@H]3C[C@@H](CC[C@H]3[C@H](\C=C\c3ccc(cn3)-c3cccc(c3)C(F)(F)F)[C@H]12)C(=O)Nc1cccnc1