Reaction Details
TargetArginase
LigandBDBM50446567
Substrate/Competitorn/a
Meas. Tech.ChEMBL_1286564 (CHEMBL3110797)
Ki 900±n/a nM
Citation de Sousa, LRRamalho, SDBurger, MCNebo, LFernandes, JBda Silva, MFIemma, MRCorrêa, CJde Souza, DHLima, MIVieira, PC Isolation of arginase inhibitors from the bioactivity-guided fractionation of Byrsonima coccolobifolia leaves and stems. J Nat Prod77:392-6 (2014) 
 
Arginase
Name:Arginase
Synonyms:n/a
Type:PROTEIN
Mol. Mass.:36149.67
Organism:Leishmania amazonensis
Description:ChEMBL_107995
Residue:329
BDBM50446567
NameBDBM50446567
Synonyms:CHEMBL3109443
TypeSmall organic molecule
Emp. Form.C21H18O10
Mol. Mass.430.3616
SMILESCC(=O)O[C@H]1[C@@H](Oc2cc(OC(C)=O)cc(OC(C)=O)c2C1=O)c1ccc(O)c(O)c1