Reaction Details
TargetPolyunsaturated fatty acid 5-lipoxygenase
LigandBDBM50446680
Substrate/Competitorn/a
Meas. Tech.ChEMBL_1290927 (CHEMBL3118900)
IC50 10.0±n/a nM
Citation Prasher, PPooja, naSingh, P Lead modification: amino acid appended indoles as highly effective 5-LOX inhibitors. Bioorg Med Chem22:1642-8 (2014) 
 
Polyunsaturated fatty acid 5-lipoxygenase
Name:Polyunsaturated fatty acid 5-lipoxygenase
Type:Enzyme
Mol. Mass.:77972.74
Organism:Homo sapiens (Human)
Description:Recombinant protein was purified from E. coli lysate. After ammonium sulfate precipitation and subsequent steps, the supernatant (S100) was used for 5-LO activity assay.
Residue:674
BDBM50446680
NameBDBM50446680
Synonyms:CHEMBL3113618
TypeSmall organic molecule
Emp. Form.C28H23N3O6S
Mol. Mass.529.564
SMILESCc1ccc(cc1)S(=O)(=O)n1cc(C(=O)C(=O)N[C@H](Cc2c[nH]c3ccccc23)C(O)=O)c2ccccc12