Reaction Details
TargetEgl nine homolog 1
LigandBDBM50446888
Substrate/Competitorn/a
Meas. Tech.ChEMBL_1290293 (CHEMBL3118615)
IC50 0.700000±n/a nM
Citation Rabinowitz, MH Inhibition of hypoxia-inducible factor prolyl hydroxylase domain oxygen sensors: tricking the body into mounting orchestrated survival and repair responses. J Med Chem56:9369-402 (2014) 
 
Egl nine homolog 1
Name:Egl nine homolog 1
Type:Protein
Mol. Mass.:46035.59
Organism:Homo sapiens (Human)
Description:Q9GZT9
Residue:426
BDBM50446888
NameBDBM50446888
Synonyms:CHEMBL3115311
TypeSmall organic molecule
Emp. Form.C19H15N5O2
Mol. Mass.345.3547
SMILESO=C(Cc1ccc2ccccc2c1)Nc1cnc([nH]c1=O)-n1cccn1