Reaction Details
TargetEgl nine homolog 1
LigandBDBM50446893
Substrate/Competitorn/a
Meas. Tech.ChEMBL_1290293 (CHEMBL3118615)
IC50 0.650000±n/a nM
Citation Rabinowitz, MH Inhibition of hypoxia-inducible factor prolyl hydroxylase domain oxygen sensors: tricking the body into mounting orchestrated survival and repair responses. J Med Chem56:9369-402 (2014) 
 
Egl nine homolog 1
Name:Egl nine homolog 1
Type:Protein
Mol. Mass.:46035.59
Organism:Homo sapiens (Human)
Description:Q9GZT9
Residue:426
BDBM50446893
NameBDBM50446893
Synonyms:CHEMBL3115307
TypeSmall organic molecule
Emp. Form.C18H12ClF3N4O5
Mol. Mass.456.76
SMILESOC(=O)CNC(=O)c1c(O)c2cc(Cl)cnc2n(Cc2ccc(nc2)C(F)(F)F)c1=O