Reaction Details
TargetD(2) dopamine receptor
LigandBDBM50446922
Substrate/Competitorn/a
Meas. Tech.ChEMBL_1290726 (CHEMBL3117738)
Ki 81±n/a nM
Citation van Wieringen, JPShalgunov, VJanssen, HMFransen, PMJanssen, AGMichel, MCBooij, JElsinga, PH Synthesis and characterization of a novel series of agonist compounds as potential radiopharmaceuticals for imaging dopamine D2/3 receptors in their high-affinity state. J Med Chem57:391-410 (2014) 
 
D(2) dopamine receptor
Name:D(2) dopamine receptor
Type:Cell-surface receptors
Mol. Mass.:50647.10
Organism:Homo sapiens (Human)
Description:P14416
Residue:443
BDBM50446922
NameBDBM50446922
Synonyms:CHEMBL3115578
TypeSmall organic molecule
Emp. Form.C22H28IN3O2
Mol. Mass.493.3811
SMILESOc1ccc2CC[C@H](CNCCN3CCN(CC3)c3ccc(I)cc3)Oc2c1