Reaction Details
TargetD(2) dopamine receptor
LigandBDBM50446924
Substrate/Competitorn/a
Meas. Tech.ChEMBL_1290727 (CHEMBL3117739)
Ki 2.06±n/a nM
Citation van Wieringen, JPShalgunov, VJanssen, HMFransen, PMJanssen, AGMichel, MCBooij, JElsinga, PH Synthesis and characterization of a novel series of agonist compounds as potential radiopharmaceuticals for imaging dopamine D2/3 receptors in their high-affinity state. J Med Chem57:391-410 (2014) 
 
D(2) dopamine receptor
Name:D(2) dopamine receptor
Type:Cell-surface receptors
Mol. Mass.:50647.10
Organism:Homo sapiens (Human)
Description:P14416
Residue:443
BDBM50446924
NameBDBM50446924
Synonyms:CHEMBL3115575
TypeSmall organic molecule
Emp. Form.C17H18INO2
Mol. Mass.395.2348
SMILESOc1ccc2CC[C@H](CNCc3cccc(I)c3)Oc2c1