Reaction Details
TargetD(2) dopamine receptor
LigandBDBM55121
Substrate/Competitorn/a
Meas. Tech.ChEMBL_1290537 (CHEMBL3119986)
Ki 22±n/a nM
Citation van Wieringen, JPShalgunov, VJanssen, HMFransen, PMJanssen, AGMichel, MCBooij, JElsinga, PH Synthesis and characterization of a novel series of agonist compounds as potential radiopharmaceuticals for imaging dopamine D2/3 receptors in their high-affinity state. J Med Chem57:391-410 (2014) 
 
D(2) dopamine receptor
Name:D(2) dopamine receptor
Type:Cell-surface receptors
Mol. Mass.:50647.10
Organism:Homo sapiens (Human)
Description:P14416
Residue:443
BDBM55121
NameBDBM55121
Synonyms:3-HYDROXYTYRAMINE HYDROCHLORIDE 4-(2-aminoethyl)pyrocatechol;hydrochloride Dopamine SMR000059081 | cid_65340
TypeSmall organic molecule
Emp. Form.C8H11NO2
Mol. Mass.153.1784
SMILESNCCc1ccc(O)c(O)c1