Reaction Details
TargetProprotein convertase subtilisin/kexin type 7
LigandBDBM50446945
Substrate/Competitorn/a
Meas. Tech.ChEMBL_1290739 (CHEMBL3117751)
Ki 72±n/a nM
Citation Kwiatkowska, ACouture, FLevesque, CLy, KDesjardins, RBeauchemin, SPrahl, ALammek, BNeugebauer, WDory, YLDay, R Design, synthesis, and structure-activity relationship studies of a potent PACE4 inhibitor. J Med Chem57:98-109 (2014) 
 
Proprotein convertase subtilisin/kexin type 7
Name:Proprotein convertase subtilisin/kexin type 7
Type:PROTEIN
Mol. Mass.:86233.43
Organism:Homo sapiens (Human)
Description:ChEMBL_1290739
Residue:785
BDBM50446945
NameBDBM50446945
Synonyms:CHEMBL3115770
TypeSmall organic molecule
Emp. Form.C48H91N15O8
Mol. Mass.1006.3318
SMILES[#6]-[#6](-[#6])-[#6]-[#6@H](-[#7]-[#6](-[#6])=O)-[#6](=O)-[#7]-[#6@@H](-[#6]-[#6](-[#6])-[#6])-[#6](=O)-[#7]-[#6@@H](-[#6]-[#6](-[#6])-[#6])-[#6](=O)-[#7]-[#6@@H](-[#6]-[#6](-[#6])-[#6])-[#6](=O)-[#7]-[#6@@H](-[#6]-[#6]-[#6]\[#7]=[#6](/[#7])-[#7])-[#6](=O)-[#7]-[#6@@H](-[#6](-[#6])-[#6])-[#6](=O)-[#7]-[#6@@H](-[#6]-[#6]-[#6]-[#6]-[#7])-[#6](=O)-[#7]-[#6]\[#6]=[#6]\[#6]\[#7]=[#6](/[#7])-[#7]