Reaction Details
TargetAldehyde dehydrogenase, dimeric NADP-preferring
LigandBDBM50447056
Substrate/Competitorn/a
Meas. Tech.ChEMBL_1289626 (CHEMBL3118133)
Ki 110±n/a nM
Citation Parajuli, BFishel, MLHurley, TD Selective ALDH3A1 inhibition by benzimidazole analogues increase mafosfamide sensitivity in cancer cells. J Med Chem57:449-61 (2014) 
 
Aldehyde dehydrogenase, dimeric NADP-preferring
Name:Aldehyde dehydrogenase, dimeric NADP-preferring
Type:Protein
Mol. Mass.:50394.38
Organism:Homo sapiens (Human)
Description:n/a
Residue:453
BDBM50447056
NameBDBM50447056
Synonyms:CHEMBL1378094 US9328112, CB7
TypeSmall organic molecule
Emp. Form.C14H11FN2O2S
Mol. Mass.290.313
SMILESCc1nc2ccccc2n1S(=O)(=O)c1ccc(F)cc1