Reaction Details
TargetAldehyde dehydrogenase, dimeric NADP-preferring
LigandBDBM50447061
Substrate/Competitorn/a
Meas. Tech.ChEMBL_1289633 (CHEMBL3118331)
IC50 700±n/a nM
Citation Parajuli, BFishel, MLHurley, TD Selective ALDH3A1 inhibition by benzimidazole analogues increase mafosfamide sensitivity in cancer cells. J Med Chem57:449-61 (2014) 
 
Aldehyde dehydrogenase, dimeric NADP-preferring
Name:Aldehyde dehydrogenase, dimeric NADP-preferring
Type:Protein
Mol. Mass.:50394.38
Organism:Homo sapiens (Human)
Description:n/a
Residue:453
BDBM50447061
NameBDBM50447061
Synonyms:CHEMBL3112688 | US9328112, A53
TypeSmall organic molecule
Emp. Form.C15H13ClN2O2S
Mol. Mass.320.794
SMILESCc1nc2ccccc2n1S(=O)(=O)c1ccc(Cl)c(C)c1