Reaction Details
TargetAldehyde dehydrogenase, dimeric NADP-preferring
LigandBDBM50447072
Substrate/Competitorn/a
Meas. Tech.ChEMBL_1289633 (CHEMBL3118331)
IC50 2100±n/a nM
Citation Parajuli, BFishel, MLHurley, TD Selective ALDH3A1 inhibition by benzimidazole analogues increase mafosfamide sensitivity in cancer cells. J Med Chem57:449-61 (2014) 
 
Aldehyde dehydrogenase, dimeric NADP-preferring
Name:Aldehyde dehydrogenase, dimeric NADP-preferring
Type:Protein
Mol. Mass.:50394.38
Organism:Homo sapiens (Human)
Description:n/a
Residue:453
BDBM50447072
NameBDBM50447072
Synonyms:CHEMBL1890994 | US9328112, A24
TypeSmall organic molecule
Emp. Form.C13H9FN2O2S
Mol. Mass.276.286
SMILESFc1ccc(cc1)S(=O)(=O)n1cnc2ccccc12