Reaction Details
TargetPhosphatidylinositol 4,5-bisphosphate 3-kinase catalytic subunit beta isoform
LigandBDBM60629
Substrate/Competitorn/a
Meas. Tech.ChEMBL_1289891 (CHEMBL3119746)
IC50 6±n/a nM
Citation Certal, VCarry, JCHalley, FVirone-Oddos, AThompson, FFiloche-Rommé, BEl-Ahmad, YKarlsson, ACharrier, VDelorme, CRak, AAbecassis, PYAmara, CVincent, LBonnevaux, HNicolas, JPMathieu, MBertrand, TMarquette, JPMichot, NBenard, TPerrin, MALemaitre, OGuerif, SPerron, SMonget, SGruss-Leleu, FDoerflinger, GGuizani, HBrollo, MDelbarre, LBertin, LRichepin, PLoyau, VGarcia-Echeverria, CLengauer, CSchio, L Discovery and optimization of pyrimidone indoline amide PI3Kß inhibitors for the treatment of phosphatase and tensin homologue (PTEN)-deficient cancers. J Med Chem57:903-20 (2014) 
 
Phosphatidylinositol 4,5-bisphosphate 3-kinase catalytic subunit beta isoform
Name:Phosphatidylinositol 4,5-bisphosphate 3-kinase catalytic subunit beta isoform
Type:Enzyme Subunit
Mol. Mass.:122769.00
Organism:Homo sapiens (Human)
Description:P42338
Residue:1070
BDBM60629
NameBDBM60629
Synonyms:BDBM50447090 | US9133168, 16b
Typen/a
Emp. Form.C18H19FN4O3
Mol. Mass.358.3669
SMILESFc1cccc2N(CCc12)C(=O)Cc1nc(cc(=O)[nH]1)N1CCOCC1