Reaction Details
TargetPhosphatidylinositol 4-phosphate 3-kinase C2 domain-containing subunit alpha
LigandBDBM60631
Substrate/Competitorn/a
Meas. Tech.ChEMBL_1289876 (CHEMBL3119546)
IC50>10000±n/a nM
Citation Certal, VCarry, JCHalley, FVirone-Oddos, AThompson, FFiloche-Rommé, BEl-Ahmad, YKarlsson, ACharrier, VDelorme, CRak, AAbecassis, PYAmara, CVincent, LBonnevaux, HNicolas, JPMathieu, MBertrand, TMarquette, JPMichot, NBenard, TPerrin, MALemaitre, OGuerif, SPerron, SMonget, SGruss-Leleu, FDoerflinger, GGuizani, HBrollo, MDelbarre, LBertin, LRichepin, PLoyau, VGarcia-Echeverria, CLengauer, CSchio, L Discovery and optimization of pyrimidone indoline amide PI3Kß inhibitors for the treatment of phosphatase and tensin homologue (PTEN)-deficient cancers. J Med Chem57:903-20 (2014) 
 
Phosphatidylinositol 4-phosphate 3-kinase C2 domain-containing subunit alpha
Name:Phosphatidylinositol 4-phosphate 3-kinase C2 domain-containing subunit alpha
Type:Protein
Mol. Mass.:190704.50
Organism:Homo sapiens (Human)
Description:O00443
Residue:1686
BDBM60631
NameBDBM60631
Synonyms:BDBM50447096 | US9133168, 19b
Typen/a
Emp. Form.C19H22N4O3
Mol. Mass.354.403
SMILESC[C@H]1Cc2ccccc2N1C(=O)Cc1nc(cc(=O)[nH]1)N1CCOCC1