Reaction Details
TargetCholine/ethanolamine kinase
LigandBDBM50447102
Substrate/Competitorn/a
Meas. Tech.ChEMBL_1289894 (CHEMBL3119749)
Kd 22000±n/a nM
Citation Rubio-Ruiz, BFiguerola-Conchas, ARamos-Torrecillas, JCapitán-Cañadas, FRíos-Marco, PCarrasco, MPGallo, MÁEspinosa, AMarco, CRuiz, CEntrena, AHurtado-Guerrero, RConejo-García, A Discovery of a new binding site on human choline kinasea1: design, synthesis, crystallographic studies, and biological evaluation of asymmetrical bispyridinium derivatives. J Med Chem57:507-15 (2014) 
 
Choline/ethanolamine kinase
Name:Choline/ethanolamine kinase
Type:PROTEIN
Mol. Mass.:45262.79
Organism:Homo sapiens (Human)
Description:ChEMBL_108033
Residue:395
BDBM50447102
NameBDBM50447102
Synonyms:CHEMBL3112879
TypeSmall organic molecule
Emp. Form.C37H41ClN4
Mol. Mass.577.2
SMILESC[N+](C)=c1ccn(Cc2ccc(CCCCc3ccc(Cn4ccc(cc4)=[N+](C)c4ccc(Cl)cc4)cc3)cc2)cc1