Reaction Details
TargetEnoyl-acyl carrier reductase ENR
LigandBDBM50447260
Substrate/Competitorn/a
Meas. Tech.ChEMBL_1290812 (CHEMBL3118190)
IC50>1000±n/a nM
Citation Wilkinson, CMcPhillie, MJZhou, YWoods, SAfanador, GARawson, SKhaliq, FPrigge, STRoberts, CWRice, DWMcLeod, RFishwick, CWMuench, SP The benzimidazole based drugs show good activity against T. gondii but poor activity against its proposed enoyl reductase enzyme target. Bioorg Med Chem Lett24:911-6 (2014) 
 
Enoyl-acyl carrier reductase ENR
Name:Enoyl-acyl carrier reductase ENR
Type:PROTEIN
Mol. Mass.:43663.67
Organism:Toxoplasma gondii
Description:ChEMBL_1290812
Residue:417
BDBM50447260
NameBDBM50447260
Synonyms:CHEMBL2270735
TypeSmall organic molecule
Emp. Form.C17H18N2
Mol. Mass.250.3382
SMILESCc1ccc(Cn2cnc3cc(C)c(C)cc23)cc1