Reaction Details
TargetHexokinase-4
LigandBDBM50447284
Substrate/Competitorn/a
Meas. Tech.ChEMBL_1291068 (CHEMBL3119630)
EC50>12500±n/a nM
Citation St Jean, DJAshton, KSBartberger, MDChen, JChmait, SCupples, RGalbreath, EHelmering, JHong, FTJordan, SRLiu, LKunz, RKMichelsen, KNishimura, NPennington, LDPoon, SFReid, DSivits, GStec, MMTadesse, STamayo, NVan, GYang, KCZhang, JNorman, MHFotsch, CLloyd, DJHale, C Small molecule disruptors of the glucokinase-glucokinase regulatory protein interaction: 2. Leveraging structure-based drug design to identify analogues with improved pharmacokinetic profiles. J Med Chem57:325-38 (2014) 
 
Hexokinase-4
Name:Hexokinase-4
Type:Enzyme
Mol. Mass.:52075.40
Organism:Mus musculus (Mouse)
Description:P52792
Residue:465
BDBM50447284
NameBDBM50447284
Synonyms:CHEMBL3113993
TypeSmall organic molecule
Emp. Form.C19H18F6N2O3S
Mol. Mass.468.413
SMILESOC(c1ccc(cc1)N1CCN(CC1)S(=O)(=O)c1ccccc1)(C(F)(F)F)C(F)(F)F