Reaction Details
TargetHexokinase-4
LigandBDBM50447266
Substrate/Competitorn/a
Meas. Tech.ChEMBL_1291068 (CHEMBL3119630)
EC50 1690±n/a nM
Citation St Jean, DJAshton, KSBartberger, MDChen, JChmait, SCupples, RGalbreath, EHelmering, JHong, FTJordan, SRLiu, LKunz, RKMichelsen, KNishimura, NPennington, LDPoon, SFReid, DSivits, GStec, MMTadesse, STamayo, NVan, GYang, KCZhang, JNorman, MHFotsch, CLloyd, DJHale, C Small molecule disruptors of the glucokinase-glucokinase regulatory protein interaction: 2. Leveraging structure-based drug design to identify analogues with improved pharmacokinetic profiles. J Med Chem57:325-38 (2014) 
 
Hexokinase-4
Name:Hexokinase-4
Type:Enzyme
Mol. Mass.:52075.40
Organism:Mus musculus (Mouse)
Description:P52792
Residue:465
BDBM50447266
NameBDBM50447266
Synonyms:CHEMBL3113986
TypeSmall organic molecule
Emp. Form.C24H30F3N3O5S2
Mol. Mass.561.637
SMILESCC(O)(c1ccc(cc1)N1CCN(C[C@@H]1CN1[C@@H]2C[C@@H](O)[C@@H]1COC2)S(=O)(=O)c1cccs1)C(F)(F)F