Reaction Details
TargetHexokinase-4
LigandBDBM50447277
Substrate/Competitorn/a
Meas. Tech.ChEMBL_1291251 (CHEMBL3117036)
IC50 1430±n/a nM
Citation St Jean, DJAshton, KSBartberger, MDChen, JChmait, SCupples, RGalbreath, EHelmering, JHong, FTJordan, SRLiu, LKunz, RKMichelsen, KNishimura, NPennington, LDPoon, SFReid, DSivits, GStec, MMTadesse, STamayo, NVan, GYang, KCZhang, JNorman, MHFotsch, CLloyd, DJHale, C Small molecule disruptors of the glucokinase-glucokinase regulatory protein interaction: 2. Leveraging structure-based drug design to identify analogues with improved pharmacokinetic profiles. J Med Chem57:325-38 (2014) 
 
Hexokinase-4
Name:Hexokinase-4
Type:Enzyme
Mol. Mass.:52175.81
Organism:Homo sapiens (Human)
Description:P35557
Residue:465
BDBM50447277
NameBDBM50447277
Synonyms:CHEMBL3114190
TypeSmall organic molecule
Emp. Form.C24H26F6N4O3S
Mol. Mass.564.544
SMILESCC(C)(C)C#CC1CN(CCN1c1ccc(cc1)C(O)(C(F)(F)F)C(F)(F)F)S(=O)(=O)c1ccc(N)nc1