Reaction Details
TargetHexokinase-4
LigandBDBM50447283
Substrate/Competitorn/a
Meas. Tech.ChEMBL_1291251 (CHEMBL3117036)
IC50 252±n/a nM
Citation St Jean, DJAshton, KSBartberger, MDChen, JChmait, SCupples, RGalbreath, EHelmering, JHong, FTJordan, SRLiu, LKunz, RKMichelsen, KNishimura, NPennington, LDPoon, SFReid, DSivits, GStec, MMTadesse, STamayo, NVan, GYang, KCZhang, JNorman, MHFotsch, CLloyd, DJHale, C Small molecule disruptors of the glucokinase-glucokinase regulatory protein interaction: 2. Leveraging structure-based drug design to identify analogues with improved pharmacokinetic profiles. J Med Chem57:325-38 (2014) 
 
Hexokinase-4
Name:Hexokinase-4
Type:Enzyme
Mol. Mass.:52175.81
Organism:Homo sapiens (Human)
Description:P35557
Residue:465
BDBM50447283
NameBDBM50447283
Synonyms:CHEMBL3113994
TypeSmall organic molecule
Emp. Form.C17H17F6N3O3S2
Mol. Mass.489.456
SMILESNc1ccc(s1)S(=O)(=O)N1CCN(CC1)c1ccc(cc1)C(O)(C(F)(F)F)C(F)(F)F