Reaction Details
TargetHexokinase-4
LigandBDBM50447273
Substrate/Competitorn/a
Meas. Tech.ChEMBL_1291068 (CHEMBL3119630)
EC50 227±n/a nM
Citation St Jean, DJAshton, KSBartberger, MDChen, JChmait, SCupples, RGalbreath, EHelmering, JHong, FTJordan, SRLiu, LKunz, RKMichelsen, KNishimura, NPennington, LDPoon, SFReid, DSivits, GStec, MMTadesse, STamayo, NVan, GYang, KCZhang, JNorman, MHFotsch, CLloyd, DJHale, C Small molecule disruptors of the glucokinase-glucokinase regulatory protein interaction: 2. Leveraging structure-based drug design to identify analogues with improved pharmacokinetic profiles. J Med Chem57:325-38 (2014) 
 
Hexokinase-4
Name:Hexokinase-4
Type:Enzyme
Mol. Mass.:52075.40
Organism:Mus musculus (Mouse)
Description:P52792
Residue:465
BDBM50447273
NameBDBM50447273
Synonyms:CHEMBL3114186
TypeSmall organic molecule
Emp. Form.C21H23F3N4O3S
Mol. Mass.468.493
SMILESCC#C[C@H]1CN(CCN1c1ccc(cc1)[C@](C)(O)C(F)(F)F)S(=O)(=O)c1ccc(N)nc1