Reaction Details
TargetHexokinase-4
LigandBDBM50447292
Substrate/Competitorn/a
Meas. Tech.ChEMBL_1291068 (CHEMBL3119630)
EC50 1790±n/a nM
Citation St Jean, DJAshton, KSBartberger, MDChen, JChmait, SCupples, RGalbreath, EHelmering, JHong, FTJordan, SRLiu, LKunz, RKMichelsen, KNishimura, NPennington, LDPoon, SFReid, DSivits, GStec, MMTadesse, STamayo, NVan, GYang, KCZhang, JNorman, MHFotsch, CLloyd, DJHale, C Small molecule disruptors of the glucokinase-glucokinase regulatory protein interaction: 2. Leveraging structure-based drug design to identify analogues with improved pharmacokinetic profiles. J Med Chem57:325-38 (2014) 
 
Hexokinase-4
Name:Hexokinase-4
Type:Enzyme
Mol. Mass.:52075.40
Organism:Mus musculus (Mouse)
Description:P52792
Residue:465
BDBM50447292
NameBDBM50447292
Synonyms:CHEMBL3113979
TypeSmall organic molecule
Emp. Form.C23H30F3N3O4S2
Mol. Mass.533.627
SMILESC[C@H]1COCCN1C[C@H]1CN(CCN1c1ccc(cc1)[C@@](C)(O)C(F)(F)F)S(=O)(=O)c1cccs1