Reaction Details
TargetHexokinase-4
LigandBDBM50447287
Substrate/Competitorn/a
Meas. Tech.ChEMBL_1291068 (CHEMBL3119630)
EC50>12500±n/a nM
Citation St Jean, DJAshton, KSBartberger, MDChen, JChmait, SCupples, RGalbreath, EHelmering, JHong, FTJordan, SRLiu, LKunz, RKMichelsen, KNishimura, NPennington, LDPoon, SFReid, DSivits, GStec, MMTadesse, STamayo, NVan, GYang, KCZhang, JNorman, MHFotsch, CLloyd, DJHale, C Small molecule disruptors of the glucokinase-glucokinase regulatory protein interaction: 2. Leveraging structure-based drug design to identify analogues with improved pharmacokinetic profiles. J Med Chem57:325-38 (2014) 
 
Hexokinase-4
Name:Hexokinase-4
Type:Enzyme
Mol. Mass.:52075.40
Organism:Mus musculus (Mouse)
Description:P52792
Residue:465
BDBM50447287
NameBDBM50447287
Synonyms:CHEMBL3113999
TypeSmall organic molecule
Emp. Form.C18H18F6N4O3S
Mol. Mass.484.416
SMILESNc1cc(ccn1)S(=O)(=O)N1CCN(CC1)c1ccc(cc1)C(O)(C(F)(F)F)C(F)(F)F