Reaction Details
TargetGlutamate receptor ionotropic, NMDA 2B
LigandBDBM50447403
Substrate/Competitorn/a
Meas. Tech.ChEMBL_1288251 (CHEMBL3117325)
Ki 3.6±n/a nM
Citation Beinat, CBanister, SDHoban, JTsanaktsidis, JMetaxas, AWindhorst, ADKassiou, M Structure-activity relationships of N-substituted 4-(trifluoromethoxy)benzamidines with affinity for GluN2B-containing NMDA receptors. Bioorg Med Chem Lett24:828-30 (2014) 
 
Glutamate receptor ionotropic, NMDA 2B
Name:Glutamate receptor ionotropic, NMDA 2B
Type:Protein
Mol. Mass.:166077.66
Organism:Rattus norvegicus (Rat)
Description:Q00960
Residue:1482
BDBM50447403
NameBDBM50447403
Synonyms:CHEMBL3114912
TypeSmall organic molecule
Emp. Form.C15H11F5N2O
Mol. Mass.330.2527
SMILESNC(=NCc1cc(F)cc(F)c1)c1ccc(OC(F)(F)F)cc1