Reaction Details
TargetPlatelet-derived growth factor receptor alpha
LigandBDBM26474
Substrate/Competitorn/a
Meas. Tech.ChEMBL_1290634 (CHEMBL3116993)
IC50 71±n/a nM
Citation Qi, HChen, LLiu, BWang, XLong, LLiu, D Synthesis and biological evaluation of novel pazopanib derivatives as antitumor agents. Bioorg Med Chem Lett24:1108-10 (2014) 
 
Platelet-derived growth factor receptor alpha
Name:Platelet-derived growth factor receptor alpha
Type:Protein
Mol. Mass.:122633.38
Organism:Homo sapiens (Human)
Description:P16234
Residue:1089
BDBM26474
NameBDBM26474
Synonyms:5-({4-[(2,3-dimethyl-2H-indazol-6-yl)(methyl)amino]pyrimidin-2-yl}amino)-2-methylbenzene-1-sulfonamide JMC514632 Compound 13 cid_10113978
TypeSmall organic molecule
Emp. Form.C21H23N7O2S
Mol. Mass.437.518
SMILESCN(c1ccc2c(C)n(C)nc2c1)c1ccnc(Nc2ccc(C)c(c2)S(N)(=O)=O)n1