Reaction Details
TargetRetinoic acid receptor alpha
LigandBDBM50447837
Substrate/Competitorn/a
Meas. Tech.ChEMBL_1290847 (CHEMBL3118432)
IC50 1277±n/a nM
Citation García-Rodríguez, JPérez-Rodríguez, SOrtiz, MAPereira, Rde Lera, ARPiedrafita, FJ Inhibition of I¿B kinase-ß and I¿B kinase-a by heterocyclic adamantyl arotinoids. Bioorg Med Chem22:1285-302 (2014) 
 
Retinoic acid receptor alpha
Name:Retinoic acid receptor alpha
Type:PROTEIN
Mol. Mass.:50778.87
Organism:Homo sapiens (Human)
Description:ChEMBL_1466191
Residue:462
BDBM50447837
NameBDBM50447837
Synonyms:CHEMBL3114297
TypeSmall organic molecule
Emp. Form.C27H27NO3S
Mol. Mass.445.573
SMILESCc1cc(O)c(cc1-c1ncc(s1)-c1ccc(cc1)C(O)=O)C12CC3CC(CC(C3)C1)C2