Reaction Details
TargetCoagulation factor XII
LigandBDBM50447848
Substrate/Competitorn/a
Meas. Tech.ChEMBL_1291598 (CHEMBL3118954)
Ki 15000±n/a nM
Citation Blizzard, TASingh, SPatil, BChidurala, NKomanduri, VDebnath, SBelyakov, SCrespo, AStruck, AKurtz, MWiltsie, JShen, XSonatore, LArocho, MLewis, DOgletree, MBiftu, T Heterocyclic core analogs of a direct thrombin inhibitor. Bioorg Med Chem Lett24:1111-5 (2014) 
 
Coagulation factor XII
Name:Coagulation factor XII
Type:Enzyme
Mol. Mass.:67810.07
Organism:Homo sapiens (Human)
Description:P00748
Residue:615
BDBM50447848
NameBDBM50447848
Synonyms:CHEMBL3114557
TypeSmall organic molecule
Emp. Form.C20H31ClN4O3
Mol. Mass.410.938
SMILESCN1CCN([C@@H](C1)C(=O)NCc1cc(Cl)ccc1CN)C(=O)[C@H](O)C(C)(C)C