Reaction Details
TargetCoagulation factor XII
LigandBDBM50447850
Substrate/Competitorn/a
Meas. Tech.ChEMBL_1291598 (CHEMBL3118954)
Ki 15000±n/a nM
Citation Blizzard, TASingh, SPatil, BChidurala, NKomanduri, VDebnath, SBelyakov, SCrespo, AStruck, AKurtz, MWiltsie, JShen, XSonatore, LArocho, MLewis, DOgletree, MBiftu, T Heterocyclic core analogs of a direct thrombin inhibitor. Bioorg Med Chem Lett24:1111-5 (2014) 
 
Coagulation factor XII
Name:Coagulation factor XII
Type:Enzyme
Mol. Mass.:67810.07
Organism:Homo sapiens (Human)
Description:P00748
Residue:615
BDBM50447850
NameBDBM50447850
Synonyms:CHEMBL3114559
TypeSmall organic molecule
Emp. Form.C20H30ClN3O3
Mol. Mass.395.924
SMILESCC(C)(C)[C@@H](O)C(=O)N1CCCC[C@H]1C(=O)NCc1cc(Cl)ccc1CN