Reaction Details
TargetCholinesterase
LigandBDBM34233
Substrate/Competitorn/a
Meas. Tech.ChEMBL_1288737 (CHEMBL3116514)
IC50 10580±n/a nM
Citation Luo, ZLiang, LSheng, JPang, YLi, JHuang, LLi, X Synthesis and biological evaluation of a new series of ebselen derivatives as glutathione peroxidase (GPx) mimics and cholinesterase inhibitors against Alzheimer's disease. Bioorg Med Chem22:1355-61 (2014) 
 
Cholinesterase
Name:Cholinesterase
Type:Enzyme
Mol. Mass.:65643.35
Organism:Equus caballus (Horse)
Description:P81908
Residue:574
BDBM34233
NameBDBM34233
Synonyms:2-Phenyl-benzo[d]isoselenazol-3-one 2-phenyl-1,2-benzisoselazol-3(2H)-one 2-phenylbenzo[d][1,2]selenazol-3(2H)-one EBSELEN MLS000028488 cid_3194 | med.21724, Compound 153
TypeSmall organic molecule
Emp. Form.C13H9NOSe
Mol. Mass.274.18
SMILESO=c1n([se]c2ccccc12)-c1ccccc1