Reaction Details
TargetPeroxisome proliferator-activated receptor gamma
LigandBDBM50448027
Substrate/Competitorn/a
Meas. Tech.ChEMBL_1288935 (CHEMBL3117632)
EC50 250±n/a nM
Citation Lamotte, YFaucher, NSançon, JPineau, OSautet, SFouchet, MHBeneton, VTousaint, JJSaintillan, YAncellin, NNicodeme, EGrillot, DMartres, P Discovery of novel indazole derivatives as dual angiotensin II antagonists and partial PPAR¿ agonists. Bioorg Med Chem Lett24:1098-103 (2014) 
 
Peroxisome proliferator-activated receptor gamma
Name:Peroxisome proliferator-activated receptor gamma
Type:PROTEIN
Mol. Mass.:57593.55
Organism:Mus musculus
Description:ChEMBL_1453700
Residue:505
BDBM50448027
NameBDBM50448027
Synonyms:CHEMBL3115245
TypeSmall organic molecule
Emp. Form.C34H33N7O
Mol. Mass.555.6721
SMILESCCCc1nn2ccc(cc2c1Cc1ccc(cc1)-c1ccccc1-c1nnn[nH]1)C(=O)NC(CC)c1ccccc1