Reaction Details
TargetALK tyrosine kinase receptor/Nucleophosmin
LigandBDBM50448048
Substrate/Competitorn/a
Meas. Tech.ChEMBL_1289134 (CHEMBL3119007)
IC50 840±n/a nM
Citation Tardy, SOrsato, AMologni, LBisson, WHDonadoni, CGambacorti-Passerini, CScapozza, LGueyrard, DGoekjian, PG Synthesis and biological evaluation of benzo[4,5]imidazo[1,2-c]pyrimidine and benzo[4,5]imidazo[1,2-a]pyrazine derivatives as anaplastic lymphoma kinase inhibitors. Bioorg Med Chem22:1303-12 (2014) 
 
ALK tyrosine kinase receptor/Nucleophosmin
Name:ALK tyrosine kinase receptor/Nucleophosmin
Synonyms:NPM/ALK (Nucleophosmin/ALK tyrosine kinase receptor)
Type:n/a
Mol. Mass.:n/a
Description:ASSAY_ID of EBI is 331455
Components:This complex has 2 components.
Component 1
Name:ALK tyrosine kinase receptor
Type:Protein
Mol. Mass.:176453.10
Organism:Homo sapiens (Human)
Description:Q9UM73
Residue:1620
Component 2
Name:Nucleophosmin
Synonyms:NPM NPM1 | NPM_HUMAN
Type:PROTEIN
Mol. Mass.:32552.99
Organism:Homo sapiens (Human)
Description:ChEMBL_1502715
Residue:294
Component 3
Name:ALK tyrosine kinase receptor
Synonyms:ALK ALK_HUMAN CD_antigen: CD246
Type:Protein
Mol. Mass.:176453.10
Organism:Homo sapiens (Human)
Description:Q9UM73
Residue:1620
BDBM50448048
NameBDBM50448048
Synonyms:CHEMBL3115504
TypeSmall organic molecule
Emp. Form.C25H19N3O
Mol. Mass.377.4379
SMILESCOc1ccc(cc1)-c1ccc2nc3cncc(\C=C\c4ccccc4)n3c2c1