Reaction Details
TargetDihydrofolate reductase
LigandBDBM50448052
Substrate/Competitorn/a
Meas. Tech.ChEMBL_1289501 (CHEMBL3117417)
IC50 4.0±n/a nM
Citation El-Subbagh, HIHassan, GSEl-Messery, SMAl-Rashood, STAl-Omary, FAAbulfadl, YSShabayek, MI Nonclassical antifolates, part 5. Benzodiazepine analogs as a new class of DHFR inhibitors: synthesis, antitumor testing and molecular modeling study. Eur J Med Chem74:234-45 (2014) 
 
Dihydrofolate reductase
Name:Dihydrofolate reductase
Type:Enzyme
Mol. Mass.:21603.71
Organism:Bos taurus (Cattle)
Description:P00376
Residue:187
BDBM50448052
NameBDBM50448052
Synonyms:CHEMBL3115740
TypeSmall organic molecule
Emp. Form.C32H34N2O4
Mol. Mass.510.6234
SMILESCOc1ccc(C=C2CCCC3C2=Nc2cc(C)c(C)cc2N=C3c2ccc(OC)c(OC)c2)cc1OC