Reaction Details
TargetAndrogen receptor
LigandBDBM50448168
Substrate/Competitorn/a
Meas. Tech.ChEMBL_1292839 (CHEMBL3122503)
Ki 239±n/a nM
Citation Carson, MWLuz, JGSuen, CMontrose, CZink, RRuan, XCheng, CCole, HAdrian, MDKohlman, DTMabry, TSnyder, NCondon, BMaletic, MClawson, DPustilnik, ACoghlan, MJ Glucocorticoid receptor modulators informed by crystallography lead to a new rationale for receptor selectivity, function, and implications for structure-based design. J Med Chem57:849-60 (2014) 
 
Androgen receptor
Name:Androgen receptor
Type:Receptor
Mol. Mass.:99185.27
Organism:Homo sapiens (Human)
Description:CHO cells were stably transfected with human AR gene.
Residue:920
BDBM50448168
NameBDBM50448168
Synonyms:CHEMBL3120317
TypeSmall organic molecule
Emp. Form.C25H25NO4S
Mol. Mass.435.535
SMILESCC\C(c1cccc(NS(C)(=O)=O)c1)=C1/c2ccccc2OCc2cccc(OC)c12